Reaction Details
TargetCannabinoid receptor 1
LigandBDBM50011334
Substrate/Competitorn/a
Meas. Tech.ChEMBL_1352142 (CHEMBL3267751)
Ki 3.2±n/a nM
Citation Ellsworth, BASher, PMWu, XWu, GSulsky, RBGu, ZMurugesan, NZhu, YYu, GSitkoff, DFCarlson, KEKang, LYang, YLee, NBaska, RAKeim, WJCullen, MJAzzara, AVZuvich, EThomas, MARohrbach, KWDevenny, JJGodonis, HEHarvey, SJMurphy, BJEverlof, GGStetsko, PIGudmundsson, OJohnghar, SRanasinghe, ABehnia, KPelleymounter, MAEwing, WR Reductions in log P improved protein binding and clearance predictions enabling the prospective design of cannabinoid receptor (CB1) antagonists with desired pharmacokinetic properties. J Med Chem56:9586-600 (2014) 
 
Cannabinoid receptor 1
Name:Cannabinoid receptor 1
Type:G Protein-Coupled Receptor (GPCR)
Mol. Mass.:52868.96
Organism:Homo sapiens (Human)
Description:P21554
Residue:472
BDBM50011334
NameBDBM50011334
Synonyms:CHEMBL3260754
TypeSmall organic molecule
Emp. Form.C26H19ClF4N6O2
Mol. Mass.558.915
SMILESCCn1nc2c(-c3ccc(Cl)cc3)c(-c3ccncc3F)c(=O)n(Cc3ccc(nc3C)C(F)(F)F)n2c1=O