Reaction Details
TargetCytochrome P450 2C19
LigandBDBM50011336
Substrate/Competitorn/a
Meas. Tech.ChEMBL_1352207 (CHEMBL3268563)
IC50>40000±n/a nM
Citation Ellsworth, BASher, PMWu, XWu, GSulsky, RBGu, ZMurugesan, NZhu, YYu, GSitkoff, DFCarlson, KEKang, LYang, YLee, NBaska, RAKeim, WJCullen, MJAzzara, AVZuvich, EThomas, MARohrbach, KWDevenny, JJGodonis, HEHarvey, SJMurphy, BJEverlof, GGStetsko, PIGudmundsson, OJohnghar, SRanasinghe, ABehnia, KPelleymounter, MAEwing, WR Reductions in log P improved protein binding and clearance predictions enabling the prospective design of cannabinoid receptor (CB1) antagonists with desired pharmacokinetic properties. J Med Chem56:9586-600 (2014) 
 
Cytochrome P450 2C19
Name:Cytochrome P450 2C19
Type:Enzyme
Mol. Mass.:55935.47
Organism:Homo sapiens (Human)
Description:P33261
Residue:490
BDBM50011336
NameBDBM50011336
Synonyms:CHEMBL3260756
TypeSmall organic molecule
Emp. Form.C27H23ClN8O2
Mol. Mass.526.977
SMILESCCn1nc2c(-c3ccc(Cl)cc3)c(-c3cnc(nc3)N(C)C)c(=O)n(Cc3ccc(cc3)C#N)n2c1=O