Reaction Details
TargetTranslocator protein
LigandBDBM50011497
Substrate/Competitorn/a
Meas. Tech.ChEMBL_1352881 (CHEMBL3269398)
Ki 1.1±n/a nM
Citation Castellano, STaliani, SViviano, MMilite, CDa Pozzo, ECosta, BBarresi, EBruno, ACosconati, SMarinelli, LGreco, GNovellino, ESbardella, GDa Settimo, FMartini, C Structure-activity relationship refinement and further assessment of 4-phenylquinazoline-2-carboxamide translocator protein ligands as antiproliferative agents in human glioblastoma tumors. J Med Chem57:2413-28 (2014) 
 
Translocator protein
Name:Translocator protein
Type:Mitochondrion membrane protein
Mol. Mass.:18945.84
Organism:Rattus norvegicus (rat)
Description:Competitive binding experiments were performed on rat kidney mitochondrial membranes.
Residue:169
BDBM50011497
NameBDBM50011497
Synonyms:CHEMBL3261907
TypeSmall organic molecule
Emp. Form.C23H18FN3O
Mol. Mass.371.4069
SMILESCN(Cc1ccccc1)C(=O)c1nc(-c2ccccc2F)c2ccccc2n1