Reaction Details
TargetTranslocator protein
LigandBDBM50011499
Substrate/Competitorn/a
Meas. Tech.ChEMBL_1352881 (CHEMBL3269398)
Ki 6.1±n/a nM
Citation Castellano, STaliani, SViviano, MMilite, CDa Pozzo, ECosta, BBarresi, EBruno, ACosconati, SMarinelli, LGreco, GNovellino, ESbardella, GDa Settimo, FMartini, C Structure-activity relationship refinement and further assessment of 4-phenylquinazoline-2-carboxamide translocator protein ligands as antiproliferative agents in human glioblastoma tumors. J Med Chem57:2413-28 (2014) 
 
Translocator protein
Name:Translocator protein
Type:Mitochondrion membrane protein
Mol. Mass.:18945.84
Organism:Rattus norvegicus (rat)
Description:Competitive binding experiments were performed on rat kidney mitochondrial membranes.
Residue:169
BDBM50011499
NameBDBM50011499
Synonyms:CHEMBL3261909
TypeSmall organic molecule
Emp. Form.C23H18ClN3O
Mol. Mass.387.862
SMILESCN(Cc1ccccc1)C(=O)c1nc(-c2ccc(Cl)cc2)c2ccccc2n1