Reaction Details
TargetPotassium voltage-gated channel subfamily H member 2
LigandBDBM50011506
Substrate/Competitorn/a
Meas. Tech.ChEMBL_1353223 (CHEMBL3266700)
IC50 2700±n/a nM
Citation Furber, MTiden, AKGardiner, PMete, AFord, RMillichip, IStein, LMather, AKinchin, ELuckhurst, CBarber, SCage, PSanganee, HAustin, RChohan, KBeri, RThong, BWallace, AOreffo, VHutchinson, RHarper, SDebreczeni, JBreed, JWissler, LEdman, K Cathepsin C inhibitors: property optimization and identification of a clinical candidate. J Med Chem57:2357-67 (2014) 
 
Potassium voltage-gated channel subfamily H member 2
Name:Potassium voltage-gated channel subfamily H member 2
Type:Multi-pass membrane protein
Mol. Mass.:126672.65
Organism:Homo sapiens (Human)
Description:Q12809
Residue:1159
BDBM50011506
NameBDBM50011506
Synonyms:CHEMBL3261920
TypeSmall organic molecule
Emp. Form.C23H24N4OS
Mol. Mass.404.528
SMILESCSc1cc(ccc1C#N)-c1ccc(C[C@H](NC(=O)[C@@H]2CCCCN2)C#N)cc1