Reaction Details
TargetPotassium voltage-gated channel subfamily H member 2
LigandBDBM50011504
Substrate/Competitorn/a
Meas. Tech.ChEMBL_1353223 (CHEMBL3266700)
IC50>33000±n/a nM
Citation Furber, MTiden, AKGardiner, PMete, AFord, RMillichip, IStein, LMather, AKinchin, ELuckhurst, CBarber, SCage, PSanganee, HAustin, RChohan, KBeri, RThong, BWallace, AOreffo, VHutchinson, RHarper, SDebreczeni, JBreed, JWissler, LEdman, K Cathepsin C inhibitors: property optimization and identification of a clinical candidate. J Med Chem57:2357-67 (2014) 
 
Potassium voltage-gated channel subfamily H member 2
Name:Potassium voltage-gated channel subfamily H member 2
Type:Multi-pass membrane protein
Mol. Mass.:126672.65
Organism:Homo sapiens (Human)
Description:Q12809
Residue:1159
BDBM50011504
NameBDBM50011504
Synonyms:CHEMBL3261928
TypeSmall organic molecule
Emp. Form.C24H26N4O3
Mol. Mass.418.4882
SMILESCN1Cc2ccc(cc2C1=O)-c1ccc(C[C@H](NC(=O)C2(N)CCOCC2)C#N)cc1