Reaction Details
TargetProcathepsin L
LigandBDBM50011505
Substrate/Competitorn/a
Meas. Tech.ChEMBL_1353343 (CHEMBL3268204)
IC50<10000±n/a nM
Citation Furber, MTiden, AKGardiner, PMete, AFord, RMillichip, IStein, LMather, AKinchin, ELuckhurst, CBarber, SCage, PSanganee, HAustin, RChohan, KBeri, RThong, BWallace, AOreffo, VHutchinson, RHarper, SDebreczeni, JBreed, JWissler, LEdman, K Cathepsin C inhibitors: property optimization and identification of a clinical candidate. J Med Chem57:2357-67 (2014) 
 
Procathepsin L
Name:Procathepsin L
Type:Enzyme
Mol. Mass.:37557.19
Organism:Homo sapiens (Human)
Description:Purchased from Calbiochem (San Diego, CA).
Residue:333
BDBM50011505
NameBDBM50011505
Synonyms:CHEMBL3261919
TypeSmall organic molecule
Emp. Form.C22H22N4O
Mol. Mass.358.4363
SMILESO=C(N[C@@H](Cc1ccc(cc1)-c1ccc(cc1)C#N)C#N)[C@@H]1CCCCN1