Reaction Details
TargetDipeptidyl peptidase 1
LigandBDBM50011508
Substrate/Competitorn/a
Meas. Tech.ChEMBL_1353220 (CHEMBL3266697)
IC50 13±n/a nM
Citation Furber, MTiden, AKGardiner, PMete, AFord, RMillichip, IStein, LMather, AKinchin, ELuckhurst, CBarber, SCage, PSanganee, HAustin, RChohan, KBeri, RThong, BWallace, AOreffo, VHutchinson, RHarper, SDebreczeni, JBreed, JWissler, LEdman, K Cathepsin C inhibitors: property optimization and identification of a clinical candidate. J Med Chem57:2357-67 (2014) 
 
Dipeptidyl peptidase 1
Name:Dipeptidyl peptidase 1
Type:Enzyme
Mol. Mass.:51857.28
Organism:Homo sapiens (Human)
Description:P53634
Residue:463
BDBM50011508
NameBDBM50011508
Synonyms:CHEMBL3261922
TypeSmall organic molecule
Emp. Form.C22H22N4O2
Mol. Mass.374.4357
SMILESO[C@H]1CCN[C@@H](C1)C(=O)N[C@@H](Cc1ccc(cc1)-c1ccc(cc1)C#N)C#N