Reaction Details
TargetKappa-type opioid receptor
LigandBDBM50116621
Substrate/Competitorn/a
Meas. Tech.ChEMBL_1352789 (CHEMBL3268189)
EC50>5000±n/a nM
Citation Urbano, MGuerrero, MRosen, HRoberts, E Antagonists of the kappa opioid receptor. Bioorg Med Chem Lett24:2021-32 (2014) 
 
Kappa-type opioid receptor
Name:Kappa-type opioid receptor
Type:G Protein-Coupled Receptor (GPCR)
Mol. Mass.:42648.76
Organism:Homo sapiens (Human)
Description:P41145
Residue:380
BDBM50116621
NameBDBM50116621
Synonyms:3-[7-Amino-4-methyl-2-(3-phenyl-propyl)-2-aza-bicyclo[3.3.1]non-5-yl]-phenol | CHEMBL333342
TypeSmall organic molecule
Emp. Form.C24H32N2O
Mol. Mass.364.5237
SMILESCC1CN(CCCc2ccccc2)C2C[C@H](N)CC1(C2)c1cccc(O)c1