Reaction Details
TargetGeranylgeranyl pyrophosphate synthase
LigandBDBM50013156
Substrate/Competitorn/a
Meas. Tech.ChEMBL_1348038 (CHEMBL3268702)
IC50 17000±n/a nM
Citation Zhou, XFerree, SDWills, VSBorn, EJTong, HWiemer, DFHolstein, SA Geranyl and neryl triazole bisphosphonates as inhibitors of geranylgeranyl diphosphate synthase. Bioorg Med Chem22:2791-8 (2014) 
 
Geranylgeranyl pyrophosphate synthase
Name:Geranylgeranyl pyrophosphate synthase
Type:Homooctamer; transferase
Mol. Mass.:34867.94
Organism:Homo sapiens (Human)
Description:Recombinant human GGPPS was cloned and expressed in E. coli.
Residue:300
BDBM50013156
NameBDBM50013156
Synonyms:CHEMBL3262351
TypeSmall organic molecule
Emp. Form.C14H21N3Na4O6P2
Mol. Mass.481.2396
SMILES[Na+].[Na+].[Na+].[Na+].[#6]\[#6](-[#6])=[#6]\[#6]-[#6]\[#6](-[#6])=[#6]\[#6]-n1cc(-[#6]-[#6](P([#8-])([#8-])=O)P([#8-])([#8-])=O)nn1