Reaction Details
TargetFarnesyl pyrophosphate synthase
LigandBDBM50013159
Substrate/Competitorn/a
Meas. Tech.ChEMBL_1348039 (CHEMBL3268703)
IC50 47000±n/a nM
Citation Zhou, XFerree, SDWills, VSBorn, EJTong, HWiemer, DFHolstein, SA Geranyl and neryl triazole bisphosphonates as inhibitors of geranylgeranyl diphosphate synthase. Bioorg Med Chem22:2791-8 (2014) 
 
Farnesyl pyrophosphate synthase
Name:Farnesyl pyrophosphate synthase
Type:Enzyme
Mol. Mass.:48272.89
Organism:Homo sapiens (Human)
Description:P14324
Residue:419
BDBM50013159
NameBDBM50013159
Synonyms:CHEMBL3262354
TypeSmall organic molecule
Emp. Form.C14H21N3Na4O7P2
Mol. Mass.497.239
SMILES[Na+].[Na+].[Na+].[Na+].[#6]\[#6](-[#6])=[#6]\[#6]-[#6][C@]1([#6])[#8]-[#6@@H]1-[#6]-n1cc(-[#6]-[#6](P([#8-])([#8-])=O)P([#8-])([#8-])=O)nn1