Reaction Details
TargetHistamine H3 receptor
LigandBDBM50013722
Substrate/Competitorn/a
Meas. Tech.ChEMBL_1349366 (CHEMBL3269589)
Ki 0.229087±n/a nM
Citation Wingen, KSchwed, JSIsensee, KWeizel, LZivkovic, AOdadzic, DOdazic, DStark, H Benzylpiperidine variations on histamine H3 receptor ligands for improved drug-likeness. Bioorg Med Chem Lett24:2236-9 (2014) 
 
Histamine H3 receptor
Name:Histamine H3 receptor
Type:G Protein-Coupled Receptor (GPCR)
Mol. Mass.:48691.47
Organism:Homo sapiens (Human)
Description:Binding assays were using CHO cells stably expressing hH3R receptors.
Residue:445
BDBM50013722
NameBDBM50013722
Synonyms:CHEMBL3264546
TypeSmall organic molecule
Emp. Form.C23H36N2O3
Mol. Mass.388.5435
SMILESCCOC(=O)C1CCN(Cc2ccc(OCCCN3CCCCC3)cc2)CC1