Reaction Details
TargetGlucose-dependent insulinotropic receptor
LigandBDBM50013911
Substrate/Competitorn/a
Meas. Tech.ChEMBL_1350259 (CHEMBL3267242)
EC50 19±n/a nM
Citation Alper, PAzimioara, MCow, CMutnick, DNikulin, VMichellys, PYWang, ZReding, EPaliotti, MLi, JBao, DZoll, JKim, YZimmerman, MGroessel, TTuntland, TJoseph, SBMcNamara, PSeidel, HMEpple, R Discovery of structurally novel, potent and orally efficacious GPR119 agonists. Bioorg Med Chem Lett24:2383-7 (2014) 
 
Glucose-dependent insulinotropic receptor
Name:Glucose-dependent insulinotropic receptor
Type:PROTEIN
Mol. Mass.:37009.07
Organism:Mus musculus
Description:ChEMBL_1506420
Residue:335
BDBM50013911
NameBDBM50013911
Synonyms:CHEMBL3260533
TypeSmall organic molecule
Emp. Form.C25H22F3N3O2
Mol. Mass.453.4563
SMILESCCOC(=O)[C@](C)(Cc1ccccc1)c1ccnc2c(cnn12)-c1ccc(cc1)C(F)(F)F