Reaction Details
TargetGlucose-dependent insulinotropic receptor
LigandBDBM50013916
Substrate/Competitorn/a
Meas. Tech.ChEMBL_1350257 (CHEMBL3267240)
EC50 4.0±n/a nM
Citation Alper, PAzimioara, MCow, CMutnick, DNikulin, VMichellys, PYWang, ZReding, EPaliotti, MLi, JBao, DZoll, JKim, YZimmerman, MGroessel, TTuntland, TJoseph, SBMcNamara, PSeidel, HMEpple, R Discovery of structurally novel, potent and orally efficacious GPR119 agonists. Bioorg Med Chem Lett24:2383-7 (2014) 
 
Glucose-dependent insulinotropic receptor
Name:Glucose-dependent insulinotropic receptor
Type:Protein
Mol. Mass.:36901.49
Organism:Homo sapiens (Human)
Description:Q8TDV5
Residue:335
BDBM50013916
NameBDBM50013916
Synonyms:CHEMBL3260535
TypeSmall organic molecule
Emp. Form.C25H24ClN3O3
Mol. Mass.449.929
SMILESCOCCOC(=O)C(C)(Cc1ccccc1)c1ccnc2c(cnn12)-c1ccc(Cl)cc1