Reaction Details
TargetEpithelial discoidin domain-containing receptor 1
LigandBDBM50437152
Substrate/Competitorn/a
Meas. Tech.ChEMBL_1350716 (CHEMBL3266101)
IC50 39±n/a nM
Citation Richters, ANguyen, HDPhan, TSimard, JRGrütter, CEngel, JRauh, D Identification of type II and III DDR2 inhibitors. J Med Chem57:4252-62 (2014) 
 
Epithelial discoidin domain-containing receptor 1
Name:Epithelial discoidin domain-containing receptor 1
Type:Tyrosine-protein kinase
Mol. Mass.:101130.02
Organism:Homo sapiens (Human)
Description:Q08345
Residue:913
BDBM50437152
NameBDBM50437152
Synonyms:CHEMBL2403816
TypeSmall organic molecule
Emp. Form.C28H28N8O
Mol. Mass.492.5749
SMILESCC(C)(C)c1cc(NC(=O)Nc2ccc(Nc3ncnc4ccccc34)cc2)n(n1)-c1cccc(N)c1