Reaction Details
TargetDiscoidin domain-containing receptor 2
LigandBDBM50362099
Substrate/Competitorn/a
Meas. Tech.ChEMBL_1350717 (CHEMBL3266102)
IC50 65±n/a nM
Citation Richters, ANguyen, HDPhan, TSimard, JRGrütter, CEngel, JRauh, D Identification of type II and III DDR2 inhibitors. J Med Chem57:4252-62 (2014) 
 
Discoidin domain-containing receptor 2
Name:Discoidin domain-containing receptor 2
Type:Protein
Mol. Mass.:96717.07
Organism:Homo sapiens (Human)
Description:Q16832
Residue:855
BDBM50362099
NameBDBM50362099
Synonyms:CHEMBL1738943 | Thiazole-urea, 9
TypeSmall organic molecule
Emp. Form.C26H30N6O2S
Mol. Mass.490.62
SMILESCc1ccc(cc1)-n1nc(cc1NC(=O)Nc1nc(CCOCc2ccncc2)cs1)C(C)(C)C