Reaction Details
TargetDiscoidin domain-containing receptor 2
LigandBDBM50437147
Substrate/Competitorn/a
Meas. Tech.ChEMBL_1350717 (CHEMBL3266102)
IC50 75±n/a nM
Citation Richters, ANguyen, HDPhan, TSimard, JRGrütter, CEngel, JRauh, D Identification of type II and III DDR2 inhibitors. J Med Chem57:4252-62 (2014) 
 
Discoidin domain-containing receptor 2
Name:Discoidin domain-containing receptor 2
Type:Protein
Mol. Mass.:96717.07
Organism:Homo sapiens (Human)
Description:Q16832
Residue:855
BDBM50437147
NameBDBM50437147
Synonyms:CHEMBL2403875
TypeSmall organic molecule
Emp. Form.C28H28N8O
Mol. Mass.492.5749
SMILESCC(C)(C)c1cc(NC(=O)Nc2cccc(Nc3ncnc4ccccc34)c2)n(n1)-c1cccc(N)c1