Reaction Details
TargetGlucocorticoid receptor
LigandBDBM50014539
Substrate/Competitorn/a
Meas. Tech.ChEMBL_1350747 (CHEMBL3266132)
IC50 2.6±n/a nM
Citation Edman, KAhlgren, RBengtsson, MBladh, HBäckström, SDahmén, JHenriksson, KHillertz, PHulikal, VJerre, AKinchin, LKåse, CLepistö, MMile, INilsson, SSmailagic, ATaylor, JTjörnebo, AWissler, LHansson, T The discovery of potent and selective non-steroidal glucocorticoid receptor modulators, suitable for inhalation. Bioorg Med Chem Lett24:2571-7 (2014) 
 
Glucocorticoid receptor
Name:Glucocorticoid receptor
Type:Enzyme
Mol. Mass.:85656.87
Organism:Homo sapiens (Human)
Description:P04150
Residue:777
BDBM50014539
NameBDBM50014539
Synonyms:CHEMBL3261412
TypeSmall organic molecule
Emp. Form.C24H27N5O2S
Mol. Mass.449.568
SMILESC[C@@H](CNc1cccc2n(ncc12)-c1cccnc1)NS(=O)(=O)c1c(C)cc(C)cc1C