Reaction Details
TargetGlucocorticoid receptor
LigandBDBM50014545
Substrate/Competitorn/a
Meas. Tech.ChEMBL_1350747 (CHEMBL3266132)
IC50 3.7±n/a nM
Citation Edman, KAhlgren, RBengtsson, MBladh, HBäckström, SDahmén, JHenriksson, KHillertz, PHulikal, VJerre, AKinchin, LKåse, CLepistö, MMile, INilsson, SSmailagic, ATaylor, JTjörnebo, AWissler, LHansson, T The discovery of potent and selective non-steroidal glucocorticoid receptor modulators, suitable for inhalation. Bioorg Med Chem Lett24:2571-7 (2014) 
 
Glucocorticoid receptor
Name:Glucocorticoid receptor
Type:Enzyme
Mol. Mass.:85656.87
Organism:Homo sapiens (Human)
Description:P04150
Residue:777
BDBM50014545
NameBDBM50014545
Synonyms:CHEMBL3261413
TypeSmall organic molecule
Emp. Form.C25H27ClN4O2S
Mol. Mass.483.025
SMILESC[C@@H](CNc1cccc2n(ncc12)-c1ccc(Cl)cc1)NS(=O)(=O)c1c(C)cc(C)cc1C