Reaction Details
TargetNitric oxide synthase, endothelial
LigandBDBM50014716
Substrate/Competitorn/a
Meas. Tech.ChEMBL_1347856 (CHEMBL3266758)
Ki 19417±n/a nM
Citation Kang, STang, WLi, HChreifi, GMartásek, PRoman, LJPoulos, TLSilverman, RB Nitric oxide synthase inhibitors that interact with both heme propionate and tetrahydrobiopterin show high isoform selectivity. J Med Chem57:4382-96 (2014) 
 
Nitric oxide synthase, endothelial
Name:Nitric oxide synthase, endothelial
Type:Enzyme
Mol. Mass.:133292.26
Organism:Bos taurus (bovine)
Description:Recombinant eNOS overexpressed in E. coli was used in enzyme assays.
Residue:1205
BDBM50014716
NameBDBM50014716
Synonyms:CHEMBL3262025 US9951014, Name 8S
TypeSmall organic molecule
Emp. Form.C22H28N6
Mol. Mass.376.4979
SMILESCc1cc(N)nc(CCc2cncc(c2)[C@@H](CN)Cc2cc(C)cc(N)n2)c1