Reaction Details
TargetRAF proto-oncogene serine/threonine-protein kinase
LigandBDBM50015314
Substrate/Competitorn/a
Meas. Tech.ChEMBL_1350550 (CHEMBL3270474)
IC50>10000±n/a nM
Citation Lee, YSChuang, SHHuang, LYLai, CLLin, YHYang, JYLiu, CWYang, SCLin, HSChang, CCLai, JYJian, PSLam, KChang, JMLau, JYHuang, JJ Discovery of 4-aryl-N-arylcarbonyl-2-aminothiazoles as Hec1/Nek2 inhibitors. Part I: optimization of in vitro potencies and pharmacokinetic properties. J Med Chem57:4098-110 (2014) 
 
RAF proto-oncogene serine/threonine-protein kinase
Name:RAF proto-oncogene serine/threonine-protein kinase
Type:Serine/threonine-protein kinase
Mol. Mass.:73082.52
Organism:Homo sapiens (Human)
Description:P04049
Residue:648
BDBM50015314
NameBDBM50015314
Synonyms:CHEMBL3263869
TypeSmall organic molecule
Emp. Form.C24H20FN3O3S
Mol. Mass.449.497
SMILESCOc1ccc(Oc2cc(C)c(-c3csc(NC(=O)c4ccnc(F)c4)n3)c(C)c2)cc1