Reaction Details
TargetCell division cycle 7-related protein kinase/Protein DBF4 homolog A
LigandBDBM50016153
Substrate/Competitorn/a
Meas. Tech.ChEMBL_1350155 (CHEMBL3266077)
IC50 42±n/a nM
Citation Reichelt, ABailis, JMBartberger, MDYao, GShu, HKaller, MRAllen, JGWeidner, MFKeegan, KSDao, JH Synthesis and structure-activity relationship of trisubstituted thiazoles as Cdc7 kinase inhibitors. Eur J Med Chem80:364-82 (2014) 
 
Cell division cycle 7-related protein kinase/Protein DBF4 homolog A
Name:Cell division cycle 7-related protein kinase/Protein DBF4 homolog A
Type:Protein
Mol. Mass.:n/a
Description:n/a
Components:This complex has 2 components.
Component 1
Name:Protein DBF4 homolog A
Synonyms:ASK Chiffon homolog A DBF4-type zinc finger-containing protein 1 DBF4A_HUMAN ZDBF1
Type:Regulatory subunit
Mol. Mass.:76869.65
Organism:Homo sapiens (Human)
Description:n/a
Residue:674
Component 2
Name:Cell division cycle 7-related protein kinase
Synonyms:CDC7 CDC7L1 Cell division cycle 7-related protein kinase (CDC7) huCdc7
Type:Protein
Mol. Mass.:63908.16
Organism:Homo sapiens (Human)
Description:O00311
Residue:574
BDBM50016153
NameBDBM50016153
Synonyms:CHEMBL3261505
TypeSmall organic molecule
Emp. Form.C10H10N4O3S
Mol. Mass.266.276
SMILESCCOC(=O)c1sc(nc1O)-c1ccnc(N)n1