Reaction Details
TargetCasein kinase I isoform alpha
LigandBDBM50016166
Substrate/Competitorn/a
Meas. Tech.ChEMBL_1350182 (CHEMBL3266487)
IC50 545±n/a nM
Citation Reichelt, ABailis, JMBartberger, MDYao, GShu, HKaller, MRAllen, JGWeidner, MFKeegan, KSDao, JH Synthesis and structure-activity relationship of trisubstituted thiazoles as Cdc7 kinase inhibitors. Eur J Med Chem80:364-82 (2014) 
 
Casein kinase I isoform alpha
Name:Casein kinase I isoform alpha
Type:Serine/threonine-protein kinase
Mol. Mass.:38936.59
Organism:Homo sapiens (Human)
Description:P48729
Residue:337
BDBM50016166
NameBDBM50016166
Synonyms:CHEMBL3261517
TypeSmall organic molecule
Emp. Form.C15H12ClN5O2S
Mol. Mass.361.806
SMILESCOc1ccc(-c2nc(sc2C(N)=O)-c2ccnc(N)n2)c(Cl)c1