Reaction Details
TargetCasein kinase I isoform delta
LigandBDBM50016166
Substrate/Competitorn/a
Meas. Tech.ChEMBL_1350338 (CHEMBL3268059)
IC50 104±n/a nM
Citation Reichelt, ABailis, JMBartberger, MDYao, GShu, HKaller, MRAllen, JGWeidner, MFKeegan, KSDao, JH Synthesis and structure-activity relationship of trisubstituted thiazoles as Cdc7 kinase inhibitors. Eur J Med Chem80:364-82 (2014) 
 
Casein kinase I isoform delta
Name:Casein kinase I isoform delta
Type:Enzyme
Mol. Mass.:47356.76
Organism:Homo sapiens (Human)
Description:P48730
Residue:415
BDBM50016166
NameBDBM50016166
Synonyms:CHEMBL3261517
TypeSmall organic molecule
Emp. Form.C15H12ClN5O2S
Mol. Mass.361.806
SMILESCOc1ccc(-c2nc(sc2C(N)=O)-c2ccnc(N)n2)c(Cl)c1