Reaction Details
TargetHistone deacetylase 1
LigandBDBM50016945
Substrate/Competitorn/a
Meas. Tech.ChEMBL_1362738 (CHEMBL3294937)
IC50 20±n/a nM
Citation Methot, JLHoffman, DMWitter, DJStanton, MGHarrington, PHamblett, CSiliphaivanh, PWilson, KHubbs, JHeidebrecht, RKral, AMOzerova, NFleming, JCWang, HSzewczak, AAMiddleton, REHughes, BCruz, JCHaines, BBChenard, MKenific, CMHarsch, ASecrist, JPMiller, TA Delayed and Prolonged Histone Hyperacetylation with a Selective HDAC1/HDAC2 Inhibitor. ACS Med Chem Lett5:340-5 (2014) 
 
Histone deacetylase 1
Name:Histone deacetylase 1
Type:Enzyme
Mol. Mass.:55090.27
Organism:Homo sapiens (Human)
Description:Q13547
Residue:482
BDBM50016945
NameBDBM50016945
Synonyms:CHEMBL3286736
TypeSmall organic molecule
Emp. Form.C25H24FN5O3
Mol. Mass.461.4882
SMILESNc1ccc(cc1NC(=O)c1ccc(nc1)N1CCC2(CNC(=O)O2)CC1)-c1ccc(F)cc1