Reaction Details
TargetHistone deacetylase 5
LigandBDBM50016941
Substrate/Competitorn/a
Meas. Tech.ChEMBL_1362737 (CHEMBL3294936)
IC50>50000±n/a nM
Citation Methot, JLHoffman, DMWitter, DJStanton, MGHarrington, PHamblett, CSiliphaivanh, PWilson, KHubbs, JHeidebrecht, RKral, AMOzerova, NFleming, JCWang, HSzewczak, AAMiddleton, REHughes, BCruz, JCHaines, BBChenard, MKenific, CMHarsch, ASecrist, JPMiller, TA Delayed and Prolonged Histone Hyperacetylation with a Selective HDAC1/HDAC2 Inhibitor. ACS Med Chem Lett5:340-5 (2014) 
 
Histone deacetylase 5
Name:Histone deacetylase 5
Type:Enzyme
Mol. Mass.:121968.61
Organism:Homo sapiens (Human)
Description:Q9UQL6
Residue:1122
BDBM50016941
NameBDBM50016941
Synonyms:CHEMBL3286732
TypeSmall organic molecule
Emp. Form.C23H23N5O3S
Mol. Mass.449.525
SMILESNc1ccc(cc1NC(=O)c1ccc(nc1)N1CCC2(CNC(=O)O2)CC1)-c1cccs1