Reaction Details
TargetMelanocortin receptor 5
LigandBDBM50017133
Substrate/Competitorn/a
Meas. Tech.ChEMBL_1365588 (CHEMBL3297369)
EC50 0.630000±n/a nM
Citation Haslach, EMHuang, HDirain, MDebevec, GGeer, PSantos, RGGiulianotti, MAPinilla, CAppel, JRDoering, SRWalters, MAHoughten, RAHaskell-Luevano, C Identification of tetrapeptides from a mixture based positional scanning library that can restore nM full agonist function of the L106P, I69T, I102S, A219V, C271Y, and C271R human melanocortin-4 polymorphic receptors (hMC4Rs). J Med Chem57:4615-28 (2014) 
 
Melanocortin receptor 5
Name:Melanocortin receptor 5
Type:Enzyme
Mol. Mass.:36966.58
Organism:Mus musculus (Mouse)
Description:P41149
Residue:325
BDBM50017133
NameBDBM50017133
Synonyms:CHEMBL3287326
TypeSmall organic molecule
Emp. Form.C36H37ClN8O7
Mol. Mass.729.181
SMILESCC(=O)N[C@@H](Cc1cnc[nH]1)C(=O)N[C@H](Cc1ccc(Cl)cc1)C(=O)N1Cc2ccccc2CC1C(=O)N[C@H](Cc1ccc(cc1)[N+]([O-])=O)C(N)=O