Reaction Details
TargetMelanocortin receptor 5
LigandBDBM50017134
Substrate/Competitorn/a
Meas. Tech.ChEMBL_1365588 (CHEMBL3297369)
EC50 2.4±n/a nM
Citation Haslach, EMHuang, HDirain, MDebevec, GGeer, PSantos, RGGiulianotti, MAPinilla, CAppel, JRDoering, SRWalters, MAHoughten, RAHaskell-Luevano, C Identification of tetrapeptides from a mixture based positional scanning library that can restore nM full agonist function of the L106P, I69T, I102S, A219V, C271Y, and C271R human melanocortin-4 polymorphic receptors (hMC4Rs). J Med Chem57:4615-28 (2014) 
 
Melanocortin receptor 5
Name:Melanocortin receptor 5
Type:Enzyme
Mol. Mass.:36966.58
Organism:Mus musculus (Mouse)
Description:P41149
Residue:325
BDBM50017134
NameBDBM50017134
Synonyms:CHEMBL3287327
TypeSmall organic molecule
Emp. Form.C32H40ClIN10O5
Mol. Mass.807.081
SMILESCC(=O)N[C@@H](Cc1cnc[nH]1)C(=O)N[C@H](Cc1ccc(Cl)cc1)C(=O)N[C@@H](CCCNC(N)=N)C(=O)N[C@@H](Cc1ccc(I)cc1)C(N)=O