Reaction Details
TargetIntegrase
LigandBDBM7461
Substrate/Competitorn/a
Meas. Tech.ChEMBL_1364393 (CHEMBL3294262)
IC50>20000±n/a nM
Citation Li, BWZhang, FHSerrao, EChen, HSanchez, TWYang, LMNeamati, NZheng, YTWang, HLong, YQ Design and discovery of flavonoid-based HIV-1 integrase inhibitors targeting both the active site and the interaction with LEDGF/p75. Bioorg Med Chem22:3146-58 (2014) 
 
Integrase
Name:Integrase
Synonyms:Human immunodeficiency virus type 1 integrase
Type:PROTEIN
Mol. Mass.:32231.48
Organism:Human immunodeficiency virus 1
Description:ChEMBL_90865
Residue:288
BDBM7461
NameBDBM7461
TypeSmall organic molecule
Emp. Form.C15H10O4
Mol. Mass.254.2375
SMILESOc1cc(O)c2c(c1)oc(cc2=O)-c1ccccc1