Reaction Details
TargetLysosomal acid glucosylceramidase
LigandBDBM50018014
Substrate/Competitorn/a
Meas. Tech.ChEMBL_1366786 (CHEMBL3297110)
Ki 1.000000±n/a nM
Citation Zoidl, MMüller, BTorvisco, ATysoe, CBenazza, MSiriwardena, AWithers, SGWrodnigg, TM Concise synthesis of C-1-cyano-iminosugars via a new Staudinger/aza Wittig/Strecker multicomponent reaction strategy. Bioorg Med Chem Lett24:2777-80 (2014) 
 
Lysosomal acid glucosylceramidase
Name:Lysosomal acid glucosylceramidase
Type:Enzyme
Mol. Mass.:59724.64
Organism:Homo sapiens (Human)
Description:The beta-Glu activity was measured with commercially available beta-glucocerebrosidase (Ceredase) as the enzyme source.
Residue:536
BDBM50018014
NameBDBM50018014
Synonyms:CHEMBL3289676
TypeSmall organic molecule
Emp. Form.C21H37NO4
Mol. Mass.367.5228
SMILESO[C@@H]1CN[C@H](CCCCCOCC23CC4CC(CC(C4)C2)C3)[C@H](O)[C@H]1O