Reaction Details
TargetCarbonic anhydrase 1
LigandBDBM50018645
Substrate/Competitorn/a
Meas. Tech.ChEMBL_1362445 (CHEMBL3292801)
IC50>10000±n/a nM
Citation Tauro, MLoiodice, FCeruso, MSupuran, CTTortorella, P Dual carbonic anhydrase/matrix metalloproteinase inhibitors incorporating bisphosphonic acid moieties targeting bone tumors. Bioorg Med Chem Lett24:2617-20 (2014) 
 
Carbonic anhydrase 1
Name:Carbonic anhydrase 1
Type:Enzyme
Mol. Mass.:28873.37
Organism:Homo sapiens (Human)
Description:P00915
Residue:261
BDBM50018645
NameBDBM50018645
Synonyms:CHEMBL3291007
TypeSmall organic molecule
Emp. Form.C7H10N2O10P2S
Mol. Mass.376.174
SMILESOP(O)(=O)C(NS(=O)(=O)c1ccc(cc1)[N+]([O-])=O)P(O)(O)=O