Reaction Details
TargetCarbonic anhydrase 2
LigandBDBM50018655
Substrate/Competitorn/a
Meas. Tech.ChEMBL_1362446 (CHEMBL3292802)
IC50 3820±n/a nM
Citation Tauro, MLoiodice, FCeruso, MSupuran, CTTortorella, P Dual carbonic anhydrase/matrix metalloproteinase inhibitors incorporating bisphosphonic acid moieties targeting bone tumors. Bioorg Med Chem Lett24:2617-20 (2014) 
 
Carbonic anhydrase 2
Name:Carbonic anhydrase 2
Type:Enzyme
Mol. Mass.:29250.71
Organism:Homo sapiens (Human)
Description:P00918
Residue:260
BDBM50018655
NameBDBM50018655
Synonyms:CHEMBL3291008
TypeSmall organic molecule
Emp. Form.C7H10N2O10P2S
Mol. Mass.376.174
SMILESOP(O)(=O)C(NS(=O)(=O)c1cccc(c1)[N+]([O-])=O)P(O)(O)=O