Reaction Details
TargetCarbonic anhydrase 2
LigandBDBM50018663
Substrate/Competitorn/a
Meas. Tech.ChEMBL_1362446 (CHEMBL3292802)
IC50 504±n/a nM
Citation Tauro, MLoiodice, FCeruso, MSupuran, CTTortorella, P Dual carbonic anhydrase/matrix metalloproteinase inhibitors incorporating bisphosphonic acid moieties targeting bone tumors. Bioorg Med Chem Lett24:2617-20 (2014) 
 
Carbonic anhydrase 2
Name:Carbonic anhydrase 2
Type:Enzyme
Mol. Mass.:29250.71
Organism:Homo sapiens (Human)
Description:P00918
Residue:260
BDBM50018663
NameBDBM50018663
Synonyms:CHEMBL3291010
TypeSmall organic molecule
Emp. Form.C11H13NO8P2S2
Mol. Mass.413.3
SMILESOP(O)(=O)C(NS(=O)(=O)c1ccc(cc1)-c1cccs1)P(O)(O)=O