Reaction Details
TargetCarbonic anhydrase 2
LigandBDBM50018669
Substrate/Competitorn/a
Meas. Tech.ChEMBL_1362446 (CHEMBL3292802)
IC50 70±n/a nM
Citation Tauro, MLoiodice, FCeruso, MSupuran, CTTortorella, P Dual carbonic anhydrase/matrix metalloproteinase inhibitors incorporating bisphosphonic acid moieties targeting bone tumors. Bioorg Med Chem Lett24:2617-20 (2014) 
 
Carbonic anhydrase 2
Name:Carbonic anhydrase 2
Type:Enzyme
Mol. Mass.:29250.71
Organism:Homo sapiens (Human)
Description:P00918
Residue:260
BDBM50018669
NameBDBM50018669
Synonyms:CHEMBL3291012
TypeSmall organic molecule
Emp. Form.C14H17NO9P2S
Mol. Mass.437.299
SMILESCOc1ccc(cc1)-c1ccc(cc1)S(=O)(=O)NC(P(O)(O)=O)P(O)(O)=O