Reaction Details
TargetCarbonic anhydrase 2
LigandBDBM50018670
Substrate/Competitorn/a
Meas. Tech.ChEMBL_1362446 (CHEMBL3292802)
IC50 71±n/a nM
Citation Tauro, MLoiodice, FCeruso, MSupuran, CTTortorella, P Dual carbonic anhydrase/matrix metalloproteinase inhibitors incorporating bisphosphonic acid moieties targeting bone tumors. Bioorg Med Chem Lett24:2617-20 (2014) 
 
Carbonic anhydrase 2
Name:Carbonic anhydrase 2
Type:Enzyme
Mol. Mass.:29250.71
Organism:Homo sapiens (Human)
Description:P00918
Residue:260
BDBM50018670
NameBDBM50018670
Synonyms:CHEMBL3291013
TypeSmall organic molecule
Emp. Form.C13H14N2O10P2S
Mol. Mass.452.27
SMILESOP(O)(=O)C(NS(=O)(=O)c1ccc(cc1)-c1ccc(cc1)[N+]([O-])=O)P(O)(O)=O