Reaction Details
TargetCarbonic anhydrase 14
LigandBDBM50018659
Substrate/Competitorn/a
Meas. Tech.ChEMBL_1362449 (CHEMBL3292805)
IC50 729±n/a nM
Citation Tauro, MLoiodice, FCeruso, MSupuran, CTTortorella, P Dual carbonic anhydrase/matrix metalloproteinase inhibitors incorporating bisphosphonic acid moieties targeting bone tumors. Bioorg Med Chem Lett24:2617-20 (2014) 
 
Carbonic anhydrase 14
Name:Carbonic anhydrase 14
Type:Enzyme
Mol. Mass.:37665.67
Organism:Homo sapiens (Human)
Description:Human (cloned) isozyme.
Residue:337
BDBM50018659
NameBDBM50018659
Synonyms:CHEMBL3291009
TypeSmall organic molecule
Emp. Form.C13H15NO8P2S
Mol. Mass.407.273
SMILESOP(O)(=O)C(NS(=O)(=O)c1ccc(cc1)-c1ccccc1)P(O)(O)=O