Reaction Details
Target72 kDa type IV collagenase
LigandBDBM50162816
Substrate/Competitorn/a
Meas. Tech.ChEMBL_1362451 (CHEMBL3292807)
IC50 49000±n/a nM
Citation Tauro, MLoiodice, FCeruso, MSupuran, CTTortorella, P Dual carbonic anhydrase/matrix metalloproteinase inhibitors incorporating bisphosphonic acid moieties targeting bone tumors. Bioorg Med Chem Lett24:2617-20 (2014) 
 
72 kDa type IV collagenase
Name:72 kDa type IV collagenase
Type:Enzyme
Mol. Mass.:73870.36
Organism:Homo sapiens (Human)
Description: P08253
Residue:660
BDBM50162816
NameBDBM50162816
Synonyms:CHEMBL180570 Methylene diphsphonate methylenediphosphonic acid
TypeSmall organic molecule
Emp. Form.CH6O6P2
Mol. Mass.176.0023
SMILESOP(O)(=O)CP(O)(O)=O