Reaction Details
Target72 kDa type IV collagenase
LigandBDBM50018629
Substrate/Competitorn/a
Meas. Tech.ChEMBL_1362451 (CHEMBL3292807)
IC50 52000±n/a nM
Citation Tauro, MLoiodice, FCeruso, MSupuran, CTTortorella, P Dual carbonic anhydrase/matrix metalloproteinase inhibitors incorporating bisphosphonic acid moieties targeting bone tumors. Bioorg Med Chem Lett24:2617-20 (2014) 
 
72 kDa type IV collagenase
Name:72 kDa type IV collagenase
Type:Enzyme
Mol. Mass.:73870.36
Organism:Homo sapiens (Human)
Description: P08253
Residue:660
BDBM50018629
NameBDBM50018629
Synonyms:CHEMBL3291004
TypeSmall organic molecule
Emp. Form.C7H9BrO8P2S
Mol. Mass.395.058
SMILESOP(O)(=O)C(P(O)(O)=O)S(=O)(=O)c1ccc(Br)cc1