Reaction Details
Target72 kDa type IV collagenase
LigandBDBM50018669
Substrate/Competitorn/a
Meas. Tech.ChEMBL_1362451 (CHEMBL3292807)
IC50 110±n/a nM
Citation Tauro, MLoiodice, FCeruso, MSupuran, CTTortorella, P Dual carbonic anhydrase/matrix metalloproteinase inhibitors incorporating bisphosphonic acid moieties targeting bone tumors. Bioorg Med Chem Lett24:2617-20 (2014) 
 
72 kDa type IV collagenase
Name:72 kDa type IV collagenase
Type:Enzyme
Mol. Mass.:73870.36
Organism:Homo sapiens (Human)
Description: P08253
Residue:660
BDBM50018669
NameBDBM50018669
Synonyms:CHEMBL3291012
TypeSmall organic molecule
Emp. Form.C14H17NO9P2S
Mol. Mass.437.299
SMILESCOc1ccc(cc1)-c1ccc(cc1)S(=O)(=O)NC(P(O)(O)=O)P(O)(O)=O