Reaction Details
TargetCarbonic anhydrase 12
LigandBDBM50018610
Substrate/Competitorn/a
Meas. Tech.ChEMBL_1362448 (CHEMBL3292804)
IC50 855±n/a nM
Citation Tauro, MLoiodice, FCeruso, MSupuran, CTTortorella, P Dual carbonic anhydrase/matrix metalloproteinase inhibitors incorporating bisphosphonic acid moieties targeting bone tumors. Bioorg Med Chem Lett24:2617-20 (2014) 
 
Carbonic anhydrase 12
Name:Carbonic anhydrase 12
Type:Enzyme
Mol. Mass.:39456.00
Organism:Homo sapiens (Human)
Description:Catalytic domain of human cloned isozyme was used in the assay
Residue:354
BDBM50018610
NameBDBM50018610
Synonyms:CHEMBL3291000
TypeSmall organic molecule
Emp. Form.C7H11NO8P2S
Mol. Mass.331.177
SMILESOP(O)(=O)C(NS(=O)(=O)c1ccccc1)P(O)(O)=O