Reaction Details
TargetCarbonic anhydrase 14
LigandBDBM50018629
Substrate/Competitorn/a
Meas. Tech.ChEMBL_1362449 (CHEMBL3292805)
IC50 6050±n/a nM
Citation Tauro, MLoiodice, FCeruso, MSupuran, CTTortorella, P Dual carbonic anhydrase/matrix metalloproteinase inhibitors incorporating bisphosphonic acid moieties targeting bone tumors. Bioorg Med Chem Lett24:2617-20 (2014) 
 
Carbonic anhydrase 14
Name:Carbonic anhydrase 14
Type:Enzyme
Mol. Mass.:37665.67
Organism:Homo sapiens (Human)
Description:Human (cloned) isozyme.
Residue:337
BDBM50018629
NameBDBM50018629
Synonyms:CHEMBL3291004
TypeSmall organic molecule
Emp. Form.C7H9BrO8P2S
Mol. Mass.395.058
SMILESOP(O)(=O)C(P(O)(O)=O)S(=O)(=O)c1ccc(Br)cc1