Reaction Details
TargetAmine oxidase [flavin-containing] A
LigandBDBM36551
Substrate/Competitorn/a
Meas. Tech.ChEMBL_1362460 (CHEMBL3292816)
IC50 57±n/a nM
Citation Wang, LEsteban, GOjima, MBautista-Aguilera, OMInokuchi, TMoraleda, IIriepa, ISamadi, AYoudim, MBRomero, ASoriano, EHerrero, RFernández Fernández, APRicardo-Martínez-Murillo, naMarco-Contelles, JUnzeta, M Donepezil + propargylamine + 8-hydroxyquinoline hybrids as new multifunctional metal-chelators, ChE and MAO inhibitors for the potential treatment of Alzheimer's disease. Eur J Med Chem80:543-61 (2014) 
 
Amine oxidase [flavin-containing] A
Name:Amine oxidase [flavin-containing] A
Type:Enzyme
Mol. Mass.:59515.21
Organism:Rattus norvegicus (rat)
Description:n/a
Residue:526
BDBM36551
NameBDBM36551
Synonyms:Chelator, M30 | US9034303, M30
TypeSmall organic molecule
Emp. Form.C14H14N2O
Mol. Mass.226.2738
SMILESCN(CC#C)Cc1ccc(O)c2ncccc12