Reaction Details
TargetALK tyrosine kinase receptor
LigandBDBM50018829
Substrate/Competitorn/a
Meas. Tech.ChEMBL_1363645 (CHEMBL3293163)
IC50 0.900000±n/a nM
Citation Johnson, TWRichardson, PFBailey, SBrooun, ABurke, BJCollins, MRCui, JJDeal, JGDeng, YLDinh, DEngstrom, LDHe, MHoffman, JHoffman, RLHuang, QKania, RSKath, JCLam, HLam, JLLe, PTLingardo, LLiu, WMcTigue, MPalmer, CLSach, NWSmeal, TSmith, GLStewart, AETimofeevski, SZhu, HZhu, JZou, HYEdwards, MP Discovery of (10R)-7-amino-12-fluoro-2,10,16-trimethyl-15-oxo-10,15,16,17-tetrahydro-2H-8,4-(metheno)pyrazolo[4,3-h][2,5,11]-benzoxadiazacyclotetradecine-3-carbonitrile (PF-06463922), a macrocyclic inhibitor of anaplastic lymphoma kinase (ALK) and c-ros oncogene 1 (ROS1) with preclinical brain expo J Med Chem57:4720-44 (2014) 
 
ALK tyrosine kinase receptor
Name:ALK tyrosine kinase receptor
Type:Protein
Mol. Mass.:176453.10
Organism:Homo sapiens (Human)
Description:Q9UM73
Residue:1620
BDBM50018829
NameBDBM50018829
Synonyms:CHEMBL3286819
TypeSmall organic molecule
Emp. Form.C21H20FN5O2
Mol. Mass.393.4142
SMILESC[C@H]1Oc2cc(cnc2N)-c2c(CCCOc3ccc(F)cc13)nn(C)c2C#N