Reaction Details
TargetALK tyrosine kinase receptor
LigandBDBM50018836
Substrate/Competitorn/a
Meas. Tech.ChEMBL_1363645 (CHEMBL3293163)
IC50 0.110000±n/a nM
Citation Johnson, TWRichardson, PFBailey, SBrooun, ABurke, BJCollins, MRCui, JJDeal, JGDeng, YLDinh, DEngstrom, LDHe, MHoffman, JHoffman, RLHuang, QKania, RSKath, JCLam, HLam, JLLe, PTLingardo, LLiu, WMcTigue, MPalmer, CLSach, NWSmeal, TSmith, GLStewart, AETimofeevski, SZhu, HZhu, JZou, HYEdwards, MP Discovery of (10R)-7-amino-12-fluoro-2,10,16-trimethyl-15-oxo-10,15,16,17-tetrahydro-2H-8,4-(metheno)pyrazolo[4,3-h][2,5,11]-benzoxadiazacyclotetradecine-3-carbonitrile (PF-06463922), a macrocyclic inhibitor of anaplastic lymphoma kinase (ALK) and c-ros oncogene 1 (ROS1) with preclinical brain expo J Med Chem57:4720-44 (2014) 
 
ALK tyrosine kinase receptor
Name:ALK tyrosine kinase receptor
Type:Protein
Mol. Mass.:176453.10
Organism:Homo sapiens (Human)
Description:Q9UM73
Residue:1620
BDBM50018836
NameBDBM50018836
Synonyms:CHEMBL3286826
TypeSmall organic molecule
Emp. Form.C20H21FN6O3
Mol. Mass.412.4175
SMILESCOc1nn(C)c2CN(C)C(=O)c3ccc(F)cc3[C@@H](C)Oc3nc(cnc3N)-c12