Reaction Details
TargetAcrosin
LigandBDBM50018980
Substrate/Competitorn/a
Meas. Tech.ChEMBL_1365286 (CHEMBL3292380)
IC50 12100±n/a nM
Citation Zhao, JTian, WQi, JLv, DLiu, YJiang, YDong, GChen, QZhou, YZhu, JWang, HSheng, CLv, J Design and synthesis of phenylisoxazole derivatives as novel human acrosin inhibitors. Bioorg Med Chem Lett24:2802-6 (2014) 
 
Acrosin
Name:Acrosin
Type:PROTEIN
Mol. Mass.:45865.48
Organism:Homo sapiens (Human)
Description:ChEMBL_1365286
Residue:421
BDBM50018980
NameBDBM50018980
Synonyms:CHEMBL3287452
TypeSmall organic molecule
Emp. Form.C19H20ClN5O2
Mol. Mass.385.847
SMILESCl.Cc1cc(C)cc(NC(=O)c2cc(on2)-c2ccc(NC(N)=N)cc2)c1