Reaction Details
TargetP2Y purinoceptor 12
LigandBDBM50439277
Substrate/Competitorn/a
Meas. Tech.ChEMBL_1361114 (CHEMBL3291829)
IC50 14±n/a nM
Citation Giordanetto, FBach, PZetterberg, FAntonsson, TBylund, RJohansson, JSellén, MBrown, DHideståhl, LBerntsson, PHovdal, DZachrisson, HBjörkman, JAvan Giezen, JJ Optimization of ketone-based P2Y(12) receptor antagonists as antithrombotic agents: pharmacodynamics and receptor kinetics considerations. Bioorg Med Chem Lett24:2963-8 (2014) 
 
P2Y purinoceptor 12
Name:P2Y purinoceptor 12
Type:Enzyme
Mol. Mass.:39458.48
Organism:Homo sapiens (Human)
Description:Q9H244
Residue:342
BDBM50439277
NameBDBM50439277
Synonyms:CHEMBL2419490
TypeSmall organic molecule
Emp. Form.C23H26N4O5S
Mol. Mass.470.541
SMILESCCOC(=O)c1cc(C#N)c(nc1C)N1CCC(CC1)C(=O)NS(=O)(=O)Cc1ccccc1