Reaction Details
TargetP2Y purinoceptor 12
LigandBDBM50019019
Substrate/Competitorn/a
Meas. Tech.ChEMBL_1361093 (CHEMBL3291547)
IC50 17±n/a nM
Citation Giordanetto, FBach, PZetterberg, FAntonsson, TBylund, RJohansson, JSellén, MBrown, DHideståhl, LBerntsson, PHovdal, DZachrisson, HBjörkman, JAvan Giezen, JJ Optimization of ketone-based P2Y(12) receptor antagonists as antithrombotic agents: pharmacodynamics and receptor kinetics considerations. Bioorg Med Chem Lett24:2963-8 (2014) 
 
P2Y purinoceptor 12
Name:P2Y purinoceptor 12
Type:Enzyme
Mol. Mass.:39458.48
Organism:Homo sapiens (Human)
Description:Q9H244
Residue:342
BDBM50019019
NameBDBM50019019
Synonyms:CHEMBL3288127
TypeSmall organic molecule
Emp. Form.C24H28N4O4S2
Mol. Mass.500.634
SMILESCCCC(=O)c1cc(C#N)c(nc1SC)N1CCC(CC1)C(=O)NS(=O)(=O)Cc1ccccc1