Reaction Details
Target5-hydroxytryptamine receptor 4
LigandBDBM50019520
Substrate/Competitorn/a
Meas. Tech.ChEMBL_1366555 (CHEMBL3296578)
Ki 52±n/a nM
Citation Castriconi, FPaolino, MGiuliani, GAnzini, MCampiani, GMennuni, LSabatini, CLanza, MCaselli, GDe Rienzo, FMenziani, MCSbraccia, MMolinari, PCosta, TCappelli, A Synthesis and structure-activity relationship studies in serotonin 5-HT4 receptor ligands based on a benzo[de][2,6]naphthridine scaffold. Eur J Med Chem82:36-46 (2014) 
 
5-hydroxytryptamine receptor 4
Name:5-hydroxytryptamine receptor 4
Type:Enzyme Catalytic Domain
Mol. Mass.:43735.29
Organism:GUINEA PIG
Description:5-HT4 HTR4 GUINEA PIG::O70528
Residue:388
BDBM50019520
NameBDBM50019520
Synonyms:CHEMBL3291075
TypeSmall organic molecule
Emp. Form.C19H24N2O3
Mol. Mass.328.4055
SMILESCOc1cc(C(=O)OCCCN2CCCCC2)c2ccccc2n1