Reaction Details
Target5-hydroxytryptamine receptor 4
LigandBDBM50388686
Substrate/Competitorn/a
Meas. Tech.ChEMBL_1366555 (CHEMBL3296578)
Ki 20±n/a nM
Citation Castriconi, FPaolino, MGiuliani, GAnzini, MCampiani, GMennuni, LSabatini, CLanza, MCaselli, GDe Rienzo, FMenziani, MCSbraccia, MMolinari, PCosta, TCappelli, A Synthesis and structure-activity relationship studies in serotonin 5-HT4 receptor ligands based on a benzo[de][2,6]naphthridine scaffold. Eur J Med Chem82:36-46 (2014) 
 
5-hydroxytryptamine receptor 4
Name:5-hydroxytryptamine receptor 4
Type:Enzyme Catalytic Domain
Mol. Mass.:43735.29
Organism:GUINEA PIG
Description:5-HT4 HTR4 GUINEA PIG::O70528
Residue:388
BDBM50388686
NameBDBM50388686
Synonyms:CHEMBL74656
TypeSmall organic molecule
Emp. Form.C23H29ClFN3O4
Mol. Mass.465.945
SMILESCO[C@@H]1CN(CCCOc2ccc(F)cc2)CC[C@@H]1NC(=O)c1cc(Cl)c(N)cc1OC