Reaction Details
Target5-hydroxytryptamine receptor 4
LigandBDBM50019529
Substrate/Competitorn/a
Meas. Tech.ChEMBL_1366556 (CHEMBL3296579)
Ki 36±n/a nM
Citation Castriconi, FPaolino, MGiuliani, GAnzini, MCampiani, GMennuni, LSabatini, CLanza, MCaselli, GDe Rienzo, FMenziani, MCSbraccia, MMolinari, PCosta, TCappelli, A Synthesis and structure-activity relationship studies in serotonin 5-HT4 receptor ligands based on a benzo[de][2,6]naphthridine scaffold. Eur J Med Chem82:36-46 (2014) 
 
5-hydroxytryptamine receptor 4
Name:5-hydroxytryptamine receptor 4
Type:Enzyme
Mol. Mass.:43767.54
Organism:Homo sapiens (Human)
Description:Q13639
Residue:388
BDBM50019529
NameBDBM50019529
Synonyms:CHEMBL3291085
TypeSmall organic molecule
Emp. Form.C19H26KN3O3S
Mol. Mass.415.591
SMILES[K+].CC(C)n1c2sccc2c([O-])c(C(=O)NCCCN2CCCCC2)c1=O